{"text_format":"3","workbook":"xlsx","n_sheets":6,"sheets":["Diagramme ","TC_1 bis Druckminderer ","TC_2 bis Druckminderer","TC_3 bis Druckminderer ","TC_4 bis Druckminderer","Datenbank Werte "],"not_rendered":{"charts":5,"macros":1},"read":"whole","date_system":"1900"}

{"sheet":"Diagramme ","index":0,"n_rows":3,"n_cols":4,"rows_kept":3,"merged":[[6,40,7,40],[6,41,6,42],[6,43,6,44],[6,45,6,46],[6,47,6,48],[19,40,20,40]]}
[]
[]
[null,"Rohrdurchmesser",0.02,"m"]

{"sheet":"TC_1 bis Druckminderer ","index":1,"n_rows":36,"n_cols":29,"rows_kept":36,"merged":[[6,2,7,2],[6,3,7,3],[6,4,7,4],[6,5,7,5],[6,6,7,6],[6,7,7,7],[6,8,7,8],[6,9,7,9],[6,10,7,10],[6,11,7,11],[6,12,7,12],[6,13,7,13],[6,14,7,14],[6,15,7,15],[6,16,7,16],[6,17,7,17],[6,18,7,18],[6,19,7,19],[6,20,7,20],[6,21,7,21],[6,22,7,22],[6,23,7,23],[6,24,7,24],[6,25,7,25],[6,26,7,26],[6,27,7,27],[6,28,7,28]]}
[]
[null,null,"Temperatur",null,338,null,"Normdichte",0.08988]
[null,null,"Massenstrom",null,{"$f":"17.64*8","v":141.12},null,"Startdruck",{"v":20,"d":"20.00"}]
[null,null,"Rauigleit (mm)",null,{"v":0.04,"d":"4.00E-02"}]
[null,null,"Innendurchmesser (m)",null,{"$f":"'Diagramme '!C3","v":0.02}]
[]
[null,null,"Rohr oder Ventil","Länge Rohrleitung ","Innendruchmesser Rohr","Rauigkeit","Massenstrom H2 ","Massenstrom H2 ","Volumenstrom H2 ","Druck","Temperatur","Dichte","dynamische Viskosität","kinematische Viskosität","Norm Dichte","Norm Volumenstrom","Geschwindigkeit","Mach-Zahl","RE-Zahl","k/d ","Rohrreibungszahl","Kv-Wert","Widerstandsbeiwert Zeta","Durckverlust durch Komponente ","Durckverlust durch Komponente ","p_1","p_2","Delta p","Delta P aufsummiert "]
[]
["System ","Komponente ","[-]","[m]","[m]2","[m]3","[kg/h]","[kg/s]","[m^3/s]","[Pa]","[K]","[kg/m^3]","[Pa*s]","[m^2/s]","[kg/m^3]","[Nm^3/h]","[m/s]","[-]","[-]","[-]","[-]","[m^3/h]","[-]","[Pa]","[bar]","[bar]","[bar]","[Pa]","[Pa]"]
[null,"H2 Kupplung ","Ventil",null,{"$f":"IF(ISTEXT(E9),$E$5,E9)","v":0.02},{"$f":"IF(ISTEXT(F9),E4*0.001,F9)","v":{"v":4e-05,"d":"4.00E-05"}},{"$f":"17.64*8","v":141.12},{"$f":"G10/3600","v":0.0392},{"$f":"H10/L10","v":{"v":0.027620418371815808,"d":"0.028"}},{"$f":"IF(ISTEXT(AA9),$H$3*100000,AA9*100000)","v":2000000},{"$f":"IF(ISTEXT(K9),E2,K9)","v":338},{"$f":"Dichte(K10,J10)","v":{"v":1.4192399069523194,"d":"1.41924"}},{"$f":"VLOOKUP(J10*0.00001,'Datenbank Werte '!$A$1:$B$500,2,TRUE)*0.000001","v":{"v":9.7159999999999981E-6,"d":"9.72E-06"}},{"$f":"M10/L10","v":{"v":6.8459179821572027E-6,"d":"6.85E-06"}},{"$f":"IF(ISTEXT(O9),H2,O9)","v":{"v":0.08988,"d":"8.99E-02"}},{"$f":"Tabelle74[[#This Row],['[kg/h']]]/Tabelle74[[#This Row],['[kg/m^3']4]]","v":{"v":1570.0934579439252,"d":"1570.09"}},{"$f":"H10*4/(L10*PI()*E10^2)","v":{"v":87.91852228281371,"d":"87.92"}},{"$f":"Tabelle74[[#This Row],['[m/s']]]/VLOOKUP(J10*0.00001,'Datenbank Werte '!$A$1:$C$500,3,TRUE)","v":{"v":0.062190367321789425,"d":"0.06"}},{"$f":"(L10*Q10*E10)/M10","v":{"v":256849.4758831741,"d":"2.5685E+05"}},{"$f":"F10/E10","v":{"v":2E-3,"d":"2.0E-03"}},{"$f":"Rohrreibungszahl(Tabelle74[[#This Row],['[-']]],Tabelle74[[#This Row],['[-']4]],Tabelle74[[#This Row],['[-']3]],Tabelle74[[#This Row],['[m']2]],Tabelle74[[#This Row],['[m']3]])","v":"Nur bei 'Rohr' benötigt"},3.53,null,{"$f":"IF(Tabelle74[[#This Row],['[-']2]]>0,Tabelle74[[#This Row],['[-']2]]*(Tabelle74[[#This Row],['[kg/m^3']]]/2)*Tabelle74[[#This Row],['[m/s']]]^2,Druckverlust(Tabelle74[[#This Row],[Spalte1]],C10,U10,V10,P10,L10,O10,J10,K10,Q10,D10,E10))","v":{"v":121072.3779401647,"d":"121072.38"}},{"$f":"X10/10^5","v":1.210723779401647},{"$f":"J10/10^5","v":{"v":20,"d":"20.00"}},{"$f":"Z10-Y10","v":{"v":18.789276220598353,"d":"18.79"}},{"$f":"X10","v":{"v":121072.3779401647,"d":"121072.38"}},{"$f":"SUM($AB$10:AB10)","v":{"v":121072.3779401647,"d":"121072.38"}}]
{"$rows_left_out":27}
{"sheet":"TC_2 bis Druckminderer","index":2,"n_rows":50,"n_cols":29,"rows_kept":50,"merged":[[6,2,7,2],[6,3,7,3],[6,4,7,4],[6,5,7,5],[6,6,7,6],[6,7,7,7],[6,8,7,8],[6,9,7,9],[6,10,7,10],[6,11,7,11],[6,12,7,12],[6,13,7,13],[6,14,7,14],[6,15,7,15],[6,16,7,16],[6,17,7,17],[6,18,7,18],[6,19,7,19],[6,20,7,20],[6,21,7,21],[6,22,7,22],[6,23,7,23],[6,24,7,24],[6,25,7,25],[6,26,7,26],[6,27,7,27],[6,28,7,28]]}
[]
[null,null,"Temperatur",null,338,null,"Normdichte",0.08988]
[null,null,"Massenstrom",null,{"$f":"17.64*8","v":141.12},null,"Startdruck",{"v":20,"d":"20.00"}]
[null,null,"Rauigleit (mm)",null,{"v":0.04,"d":"4.00E-02"}]
[null,null,"Innendurchmesser",null,{"$f":"'Diagramme '!C3","v":0.02}]
[]
[null,null,"Rohr oder Ventil","Länge Rohrleitung ","Innendruchmesser Rohr","Rauigkeit","Massenstrom H2 ","Massenstrom H2 ","Volumenstrom H2 ","Druck","Temperatur","Dichte","dynamische Viskosität","kinematische Viskosität","Norm Dichte","Norm Volumenstrom","Geschwindigkeit","Mach-Zahl","RE-Zahl","k/d ","Rohrreibungszahl","Kv-Wert","Widerstandsbeiwert Zeta","Durckverlust durch Komponente ","Durckverlust durch Komponente ","p_1","p_2","Delta p","Delta P aufsummiert "]
[]
["System ","Komponente ","[-]","[m]","[m]2","[m]3","[kg/h]","[kg/s]","[m^3/s]","[Pa]","[K]","[kg/m^3]","[Pa*s]","[m^2/s]","[kg/m^3]","[Nm^3/h]","[m/s]","[-]","[-]","[-]","[-]","[m^3/h]","[-]","[Pa]","[bar]","[bar]","[bar]","[Pa]","[Pa]"]
[null,"H2 Kupplung ","Ventil",null,{"$f":"IF(ISTEXT(E9),$E$5,E9)","v":0.02},{"$f":"IF(ISTEXT(F9),E4*0.001,F9)","v":{"v":4e-05,"d":"4.00E-05"}},{"$f":"17.64*8","v":141.12},{"$f":"G10/3600","v":0.0392},{"$f":"H10/L10","v":0.027620418371815808},{"$f":"IF(ISTEXT(AA9),$H$3*100000,AA9*100000)","v":2000000},{"$f":"IF(ISTEXT(K9),E2,K9)","v":338},{"$f":"Dichte(K10,J10)","v":{"v":1.4192399069523194,"d":"1.41924"}},{"$f":"VLOOKUP(J10*0.00001,'Datenbank Werte '!$A$1:$B$500,2,TRUE)*0.000001","v":{"v":9.7159999999999981E-6,"d":"9.72E-06"}},{"$f":"M10/L10","v":{"v":6.8459179821572027E-6,"d":"6.85E-06"}},{"$f":"IF(ISTEXT(O9),H2,O9)","v":0.08988},{"$f":"Tabelle7[[#This Row],['[kg/h']]]/Tabelle7[[#This Row],['[kg/m^3']4]]","v":{"v":1570.0934579439252,"d":"1570.09"}},{"$f":"H10*4/(L10*PI()*E10^2)","v":{"v":87.91852228281371,"d":"87.92"}},{"$f":"Tabelle7[[#This Row],['[m/s']]]/VLOOKUP(J10*0.00001,'Datenbank Werte '!$A$1:$C$500,3,TRUE)","v":{"v":0.062190367321789425,"d":"0.06"}},{"$f":"(L10*Q10*E10)/M10","v":{"v":256849.4758831741,"d":"2.5685E+05"}},{"$f":"F10/E10","v":{"v":2E-3,"d":"2.0E-03"}},{"$f":"Rohrreibungszahl(Tabelle7[[#This Row],['[-']]],Tabelle7[[#This Row],['[-']4]],Tabelle7[[#This Row],['[-']3]],Tabelle7[[#This Row],['[m']2]],Tabelle7[[#This Row],['[m']3]])","v":"Nur bei 'Rohr' benötigt"},3.53,null,{"$f":"IF(Tabelle7[[#This Row],['[-']2]]>0,Tabelle7[[#This Row],['[-']2]]*(Tabelle7[[#This Row],['[kg/m^3']]]/2)*Tabelle7[[#This Row],['[m/s']]]^2,Druckverlust(Tabelle7[[#This Row],[Spalte1]],C10,U10,V10,P10,L10,O10,J10,K10,Q10,D10,E10))","v":{"v":121072.3779401647,"d":"121072.38"}},{"$f":"X10/10^5","v":1.210723779401647},{"$f":"J10/10^5","v":{"v":20,"d":"20.00"}},{"$f":"Z10-Y10","v":{"v":18.789276220598353,"d":"18.79"}},{"$f":"X10","v":{"v":121072.3779401647,"d":"121072.38"}},{"$f":"SUM($AB$10:AB10)","v":{"v":121072.3779401647,"d":"121072.38"}}]
{"$rows_left_out":41}
{"sheet":"TC_3 bis Druckminderer ","index":3,"n_rows":33,"n_cols":29,"rows_kept":33,"merged":[[6,2,7,2],[6,3,7,3],[6,4,7,4],[6,5,7,5],[6,6,7,6],[6,7,7,7],[6,8,7,8],[6,9,7,9],[6,10,7,10],[6,11,7,11],[6,12,7,12],[6,13,7,13],[6,14,7,14],[6,15,7,15],[6,16,7,16],[6,17,7,17],[6,18,7,18],[6,19,7,19],[6,20,7,20],[6,21,7,21],[6,22,7,22],[6,23,7,23],[6,24,7,24],[6,25,7,25],[6,26,7,26],[6,27,7,27],[6,28,7,28]]}
[]
[null,null,"Temperatur",null,338,null,"Normdichte",0.08988]
[null,null,"Massenstrom",null,{"$f":"17.64*8","v":141.12},null,"Startdruck",{"v":20,"d":"20.00"}]
[null,null,"Rauigleit (mm)",null,{"v":0.04,"d":"4.00E-02"}]
[null,null,"Innendurchmesser",null,{"$f":"'Diagramme '!C3","v":0.02}]
[]
[null,null,"Rohr oder Ventil","Länge Rohrleitung ","Innendruchmesser Rohr","Rauigkeit","Massenstrom H2 ","Massenstrom H2 ","Volumenstrom H2 ","Druck","Temperatur","Dichte","dynamische Viskosität","kinematische Viskosität","Norm Dichte","Norm Volumenstrom","Geschwindigkeit","Mach-Zahl","RE-Zahl","k/d ","Rohrreibungszahl","Kv-Wert","Widerstandsbeiwert Zeta","Durckverlust durch Komponente ","Durckverlust durch Komponente ","p_1","p_2","Delta p","Delta P aufsummiert "]
[]
["System ","Komponente ","[-]","[m]","[m]2","[m]3","[kg/h]","[kg/s]","[m^3/s]","[Pa]","[K]","[kg/m^3]","[Pa*s]","[m^2/s]","[kg/m^3]","[Nm^3/h]","[m/s]","[-]","[-]","[-]","[-]","[m^3/h]","[-]","[Pa]","[bar]","[bar]","[bar]","[Pa]","[Pa]"]
[null,"H2 Kupplung ","Ventil",null,{"$f":"IF(ISTEXT(E9),$E$5,E9)","v":0.02},{"$f":"IF(ISTEXT(F9),E4*0.001,F9)","v":{"v":4e-05,"d":"4.00E-05"}},{"$f":"17.64*8","v":141.12},{"$f":"G10/3600","v":0.0392},{"$f":"H10/L10","v":{"v":0.027620418371815808,"d":"2.76E-02"}},{"$f":"IF(ISTEXT(AA9),$H$3*100000,AA9*100000)","v":2000000},{"$f":"IF(ISTEXT(K9),E2,K9)","v":338},{"$f":"Dichte(K10,J10)","v":{"v":1.4192399069523194,"d":"1.41924"}},{"$f":"VLOOKUP(J10*0.00001,'Datenbank Werte '!$A$1:$B$500,2,TRUE)*0.000001","v":{"v":9.7159999999999981E-6,"d":"9.72E-06"}},{"$f":"M10/L10","v":{"v":6.8459179821572027E-6,"d":"6.85E-06"}},{"$f":"IF(ISTEXT(O9),H2,O9)","v":{"v":0.08988,"d":"8.99E-02"}},{"$f":"Tabelle745[[#This Row],['[kg/h']]]/Tabelle745[[#This Row],['[kg/m^3']4]]","v":{"v":1570.0934579439252,"d":"1570.09"}},{"$f":"H10*4/(L10*PI()*E10^2)","v":{"v":87.91852228281371,"d":"87.92"}},{"$f":"Tabelle745[[#This Row],['[m/s']]]/VLOOKUP(J10*0.00001,'Datenbank Werte '!$A$1:$C$500,3,TRUE)","v":{"v":0.062190367321789425,"d":"0.06"}},{"$f":"(L10*Q10*E10)/M10","v":{"v":256849.4758831741,"d":"2.5685E+05"}},{"$f":"F10/E10","v":{"v":2E-3,"d":"2.0E-03"}},{"$f":"Rohrreibungszahl(Tabelle745[[#This Row],['[-']]],Tabelle745[[#This Row],['[-']4]],Tabelle745[[#This Row],['[-']3]],Tabelle745[[#This Row],['[m']2]],Tabelle745[[#This Row],['[m']3]])","v":"Nur bei 'Rohr' benötigt"},3.53,null,{"$f":"IF(Tabelle745[[#This Row],['[-']2]]>0,Tabelle745[[#This Row],['[-']2]]*(Tabelle745[[#This Row],['[kg/m^3']]]/2)*Tabelle745[[#This Row],['[m/s']]]^2,Druckverlust(Tabelle745[[#This Row],[Spalte1]],C10,U10,V10,P10,L10,O10,J10,K10,Q10,D10,E10))","v":{"v":121072.3779401647,"d":"121072.38"}},{"$f":"X10/10^5","v":1.210723779401647},{"$f":"J10/10^5","v":{"v":20,"d":"20.00"}},{"$f":"Z10-Y10","v":{"v":18.789276220598353,"d":"18.79"}},{"$f":"X10","v":{"v":121072.3779401647,"d":"121072.38"}},{"$f":"SUM($AB$10:AB10)","v":{"v":121072.3779401647,"d":"121072.38"}}]
{"$rows_left_out":24}
{"sheet":"TC_4 bis Druckminderer","index":4,"n_rows":37,"n_cols":29,"rows_kept":37,"merged":[[6,2,7,2],[6,3,7,3],[6,4,7,4],[6,5,7,5],[6,6,7,6],[6,7,7,7],[6,8,7,8],[6,9,7,9],[6,10,7,10],[6,11,7,11],[6,12,7,12],[6,13,7,13],[6,14,7,14],[6,15,7,15],[6,16,7,16],[6,17,7,17],[6,18,7,18],[6,19,7,19],[6,20,7,20],[6,21,7,21],[6,22,7,22],[6,23,7,23],[6,24,7,24],[6,25,7,25],[6,26,7,26],[6,27,7,27],[6,28,7,28]]}
[]
[null,null,"Temperatur",null,338,null,"Normdichte",0.08988]
[null,null,"Massenstrom",null,{"$f":"17.64*8","v":141.12},null,"Startdruck",{"v":20,"d":"20.00"}]
[null,null,"Rauigleit (mm)",null,{"v":0.04,"d":"4.00E-02"}]
[null,null,"Innendurchmesser",null,{"$f":"'Diagramme '!C3","v":0.02}]
[]
[null,null,"Rohr oder Ventil","Länge Rohrleitung ","Innendruchmesser Rohr","Rauigkeit","Massenstrom H2 ","Massenstrom H2 ","Volumenstrom H2 ","Druck","Temperatur","Dichte","dynamische Viskosität","kinematische Viskosität","Norm Dichte","Norm Volumenstrom","Geschwindigkeit","Mach-Zahl","RE-Zahl","k/d ","Rohrreibungszahl","Kv-Wert","Widerstandsbeiwert Zeta","Durckverlust durch Komponente ","Durckverlust durch Komponente ","p_1","p_2","Delta p","Delta P aufsummiert "]
[]
["System ","Komponente ","[-]","[m]","[m]2","[m]3","[kg/h]","[kg/s]","[m^3/s]","[Pa]","[K]","[kg/m^3]","[Pa*s]","[m^2/s]","[kg/m^3]","[Nm^3/h]","[m/s]","[-]","[-]","[-]","[-]","[m^3/h]","[-]","[Pa]","[bar]","[bar]","[bar]","[Pa]","[Pa]"]
[null,"H2 Kupplung ","Ventil",null,{"$f":"IF(ISTEXT(E9),$E$5,E9)","v":0.02},{"$f":"IF(ISTEXT(F9),E4*0.001,F9)","v":{"v":4e-05,"d":"4.00E-05"}},{"$f":"17.64*8","v":141.12},{"$f":"G10/3600","v":0.0392},{"$f":"H10/L10","v":{"v":0.027620418371815808,"d":"2.76E-02"}},{"$f":"IF(ISTEXT(AA9),$H$3*100000,AA9*100000)","v":2000000},{"$f":"IF(ISTEXT(K9),E2,K9)","v":338},{"$f":"Dichte(K10,J10)","v":{"v":1.4192399069523194,"d":"1.41924"}},{"$f":"VLOOKUP(J10*0.00001,'Datenbank Werte '!$A$1:$B$500,2,TRUE)*0.000001","v":{"v":9.7159999999999981E-6,"d":"9.72E-06"}},{"$f":"M10/L10","v":{"v":6.8459179821572027E-6,"d":"6.85E-06"}},{"$f":"IF(ISTEXT(O9),H2,O9)","v":{"v":0.08988,"d":"8.99E-02"}},{"$f":"Tabelle76[[#This Row],['[kg/h']]]/Tabelle76[[#This Row],['[kg/m^3']4]]","v":{"v":1570.0934579439252,"d":"1570.09"}},{"$f":"H10*4/(L10*PI()*E10^2)","v":{"v":87.91852228281371,"d":"87.92"}},{"$f":"Tabelle76[[#This Row],['[m/s']]]/VLOOKUP(J10*0.00001,'Datenbank Werte '!$A$1:$C$500,3,TRUE)","v":{"v":0.062190367321789425,"d":"0.06"}},{"$f":"(L10*Q10*E10)/M10","v":{"v":256849.4758831741,"d":"2.5685E+05"}},{"$f":"F10/E10","v":{"v":2E-3,"d":"2.0E-03"}},{"$f":"Rohrreibungszahl(Tabelle76[[#This Row],['[-']]],Tabelle76[[#This Row],['[-']4]],Tabelle76[[#This Row],['[-']3]],Tabelle76[[#This Row],['[m']2]],Tabelle76[[#This Row],['[m']3]])","v":"Nur bei 'Rohr' benötigt"},3.53,null,{"$f":"IF(Tabelle76[[#This Row],['[-']2]]>0,Tabelle76[[#This Row],['[-']2]]*(Tabelle76[[#This Row],['[kg/m^3']]]/2)*Tabelle76[[#This Row],['[m/s']]]^2,Druckverlust(Tabelle76[[#This Row],[Spalte1]],C10,U10,V10,P10,L10,O10,J10,K10,Q10,D10,E10))","v":{"v":121072.3779401647,"d":"121072.38"}},{"$f":"X10/10^5","v":1.210723779401647},{"$f":"J10/10^5","v":{"v":20,"d":"20.00"}},{"$f":"Z10-Y10","v":{"v":18.789276220598353,"d":"18.79"}},{"$f":"X10","v":{"v":121072.3779401647,"d":"121072.38"}},{"$f":"SUM($AB$10:AB10)","v":{"v":121072.3779401647,"d":"121072.38"}}]
{"$rows_left_out":28}
{"sheet":"Datenbank Werte ","index":5,"n_rows":503,"n_cols":3,"rows_kept":503}
["Pressure (bar)","Viscosity (uPa*s)","Sound Spd, (m/s)"]
[0,9.707,1397.6]
[1,9.7074,1398.4]
[2,9.7077,1399.2]
[3,9.7081,1400]
[4,9.7084,1400.8]
[5,9.7088,1401.6]
[6,9.7092,1402.4]
[7,9.7096,1403.2]
[8,9.71,1404]
{"$rows_left_out":493}