{"text_format":"3","workbook":"xlsx","n_sheets":2,"sheets":["TC_A2 bis Druckminderer","Datenbak Werte"],"not_rendered":{"macros":1},"read":"whole","date_system":"1900"}

{"sheet":"TC_A2 bis Druckminderer","index":0,"n_rows":58,"n_cols":29,"rows_kept":58,"merged":[[6,2,7,2],[6,3,7,3],[6,4,7,4],[6,5,7,5],[6,6,7,6],[6,7,7,7],[6,8,7,8],[6,9,7,9],[6,10,7,10],[6,11,7,11],[6,12,7,12],[6,13,7,13],[6,14,7,14],[6,15,7,15],[6,16,7,16],[6,17,7,17],[6,18,7,18],[6,19,7,19],[6,20,7,20],[6,21,7,21],[6,22,7,22],[6,23,7,23],[6,24,7,24],[6,25,7,25],[6,26,7,26],[6,27,7,27],[6,28,7,28]]}
[]
[null,null,"Temperatur",null,338,null,"Normdichte",0.08988]
[null,null,"Massenstrom",null,{"$f":"17.64*8","v":141.12},null,"Startdruck",{"v":20,"d":"20.00"}]
[null,null,"Rauigeit (mm)",null,{"v":0.04,"d":"4.00E-02"}]
[null,null,"Innendurchmesser (mm)",null,0.019]
[]
[null,null,"Rohr oder Ventil","Länge Rohrleitung ","Innendruchmesser Rohr","Rauigkeit","Massenstrom H2 ","Massenstrom H2 ","Volumenstrom H2 ","Druck","Temperatur","Dichte","dynamische Viskosität","kinematische Viskosität","Norm Dichte","Norm Volumenstrom","Geschwindigkeit","Mach-Zahl","RE-Zahl","k/d ","Rohrreibungszahl","Kv-Wert","Widerstandsbeiwert Zeta","Durckverlust durch Komponente ","Durckverlust durch Komponente ","p_1","p_2","Delta p","Delta P aufsummiert "]
[]
["System ","Komponente ","[-]","[m]","[m]2","[m]3","[kg/h]","[kg/s]","[m^3/s]","[Pa]","[K]","[kg/m^3]","[Pa*s]","[m^2/s]","[kg/m^3]","[Nm^3/h]","[m/s]","[-]","[-]","[-]","[-]","[m^3/h]","[-]","[Pa]","[bar]","[bar]","[bar]","[Pa]","[Pa]"]
[null,"H2 Kupplung ","Ventil",null,{"$f":"IF(ISTEXT(E9),$E$5,E9)","v":0.019},{"$f":"IF(ISTEXT(F9),E4*0.001,F9)","v":{"v":4e-05,"d":"4.00E-05"}},{"$f":"17.64*8","v":141.12},{"$f":"G10/3600","v":0.0392},{"$f":"H10/L10","v":{"v":0.027620418371815808,"d":"2.76E-02"}},{"$f":"IF(ISTEXT(AA9),$H$3*100000,AA9*100000)","v":2000000},{"$f":"IF(ISTEXT(K9),E2,K9)","v":338},{"$f":"Dichte(K10,J10)","v":{"v":1.4192399069523194,"d":"1.41924"}},{"$f":"VLOOKUP(J10*0.00001,'Datenbak Werte'!$A$1:$B$500,2,TRUE)*0.000001","v":{"v":9.7159999999999981E-6,"d":"9.72E-06"}},{"$f":"M10/L10","v":{"v":6.8459179821572027E-6,"d":"6.85E-06"}},{"$f":"IF(ISTEXT(O9),H2,O9)","v":{"v":0.08988,"d":"8.99E-02"}},{"$f":"Tabelle7[[#This Row],['[kg/h']]]/Tabelle7[[#This Row],['[kg/m^3']4]]","v":{"v":1570.0934579439252,"d":"1570.09"}},{"$f":"H10*4/(L10*PI()*E10^2)","v":{"v":97.41664518871325,"d":"97.42"}},{"$f":"Tabelle7[[#This Row],['[m/s']]]/VLOOKUP(J10*0.00001,'Datenbak Werte'!$A$1:$C$500,3,TRUE)","v":{"v":0.06890899426237054,"d":"0.07"}},{"$f":"(L10*Q10*E10)/M10","v":{"v":270367.86935070954,"d":"2.7037E+05"}},{"$f":"F10/E10","v":{"v":2.1052631578947372E-3,"d":"2.1E-03"}},{"$f":"Rohrreibungszahl(Tabelle7[[#This Row],['[-']]],Tabelle7[[#This Row],['[-']4]],Tabelle7[[#This Row],['[-']3]],Tabelle7[[#This Row],['[m']2]],Tabelle7[[#This Row],['[m']3]])","v":"Nur bei 'Rohr' benötigt"},3.53,null,{"$f":"IF(Tabelle7[[#This Row],['[-']2]]>0,Tabelle7[[#This Row],['[-']2]]*(Tabelle7[[#This Row],['[kg/m^3']]]/2)*Tabelle7[[#This Row],['[m/s']]]^2,Druckverlust(Tabelle7[[#This Row],[Spalte1]],C10,U10,V10,P10,L10,O10,J10,K10,Q10,D10,E10))","v":{"v":121072.3779401647,"d":"121072.38"}},{"$f":"X10/10^5","v":1.210723779401647},{"$f":"J10/10^5","v":{"v":20,"d":"20.00"}},{"$f":"Z10-Y10","v":{"v":18.789276220598353,"d":"18.79"}},{"$f":"X10","v":{"v":121072.3779401647,"d":"121072.38"}},{"$f":"SUM($AB$10:AB10)","v":{"v":121072.3779401647,"d":"121072.38"}}]
[null,"Schlauch","Rohr",1,{"$f":"IF(ISTEXT(E10),$E$5,E10)","v":0.019},{"v":4e-05,"d":"4.00E-05"},141.12,{"$f":"G11/3600","v":0.0392},{"$f":"H11/L11","v":{"v":0.02938107177885136,"d":"2.94E-02"}},{"$f":"IF(ISTEXT(AA10),$H$3*100000,AA10*100000)","v":1878927.6220598354},{"$f":"IF(ISTEXT(K10),E3,K10)","v":338},{"$f":"Dichte(K11,J11)","v":{"v":1.3341923090843932,"d":"1.33419"}},{"$f":"VLOOKUP(J11*0.00001,'Datenbak Werte'!$A$1:$B$500,2,TRUE)*0.000001","v":{"v":9.7148999999999991E-6,"d":"9.71E-06"}},{"$f":"M11/L11","v":{"v":7.2814840363357924E-6,"d":"7.28E-06"}},{"$f":"IF(ISTEXT(O10),H3,O10)","v":{"v":0.08988,"d":"8.99E-02"}},{"$f":"Tabelle7[[#This Row],['[kg/h']]]/Tabelle7[[#This Row],['[kg/m^3']4]]","v":{"v":1570.0934579439252,"d":"1570.09"}},{"$f":"H11*4/(L11*PI()*E11^2)","v":{"v":103.62643339483614,"d":"103.63"}},{"$f":"Tabelle7[[#This Row],['[m/s']]]/VLOOKUP(J11*0.00001,'Datenbak Werte'!$A$1:$C$500,3,TRUE)","v":{"v":0.07338462813882597,"d":"0.07"}},{"$f":"(L11*Q11*E11)/M11","v":{"v":270398.4826000776,"d":"2.7040E+05"}},{"$f":"F11/E11","v":{"v":2.1052631578947372E-3,"d":"2.1E-03"}},{"$f":"Rohrreibungszahl(Tabelle7[[#This Row],['[-']]],Tabelle7[[#This Row],['[-']4]],Tabelle7[[#This Row],['[-']3]],Tabelle7[[#This Row],['[m']2]],Tabelle7[[#This Row],['[m']3]])","v":{"v":0.024359666043942293,"d":"2.44E-02"}},null,null,{"$f":"IF(Tabelle7[[#This Row],['[-']2]]>0,Tabelle7[[#This Row],['[-']2]]*(Tabelle7[[#This Row],['[kg/m^3']]]/2)*Tabelle7[[#This Row],['[m/s']]]^2,Druckverlust(Tabelle7[[#This Row],[Spalte1]],C11,U11,V11,P11,L11,O11,J11,K11,Q11,D11,E11))","v":{"v":9184.325522176354,"d":"9184.33"}},0.09184325522176354,{"$f":"J11/10^5","v":{"v":18.789276220598353,"d":"18.79"}},{"$f":"Z11-Y11","v":{"v":18.69743296537659,"d":"18.70"}},{"$f":"X11","v":{"v":9184.325522176354,"d":"9184.33"}},{"$f":"SUM($AB$10:AB11)","v":{"v":130256.70346234106,"d":"130256.70"}}]
[null,"90°Winkel","Rohr",null,0.019,{"v":4e-05,"d":"4.00E-05"},141.12,0.0392,{"v":0.02952393639436313,"d":"2.95E-02"},1869743.296537659,338,{"$f":"Dichte(K12,J12)","v":{"v":1.3277362298979982,"d":"1.32774"}},{"$f":"VLOOKUP(J12*0.00001,'Datenbak Werte'!$A$1:$B$500,2,TRUE)*0.000001","v":{"v":9.7148999999999991E-6,"d":"9.71E-06"}},{"v":7.3168900427958758E-6,"d":"7.32E-06"},{"v":0.08988,"d":"8.99E-02"},{"$f":"Tabelle7[[#This Row],['[kg/h']]]/Tabelle7[[#This Row],['[kg/m^3']4]]","v":{"v":1570.0934579439252,"d":"1570.09"}},{"v":104.13031394334851,"d":"104.13"},{"$f":"Tabelle7[[#This Row],['[m/s']]]/VLOOKUP(J12*0.00001,'Datenbak Werte'!$A$1:$C$500,3,TRUE)","v":{"v":0.07374145878007826,"d":"0.07"}},{"v":270398.4826000776,"d":"2.7040E+05"},{"v":2.1052631578947372E-3,"d":"2.1E-03"},{"$f":"Rohrreibungszahl(Tabelle7[[#This Row],['[-']]],Tabelle7[[#This Row],['[-']4]],Tabelle7[[#This Row],['[-']3]],Tabelle7[[#This Row],['[m']2]],Tabelle7[[#This Row],['[m']3]])","v":{"v":0.024359666043942293,"d":"2.44E-02"}},null,0.15,{"$f":"IF(Tabelle7[[#This Row],['[-']2]]>0,Tabelle7[[#This Row],['[-']2]]*(Tabelle7[[#This Row],['[kg/m^3']]]/2)*Tabelle7[[#This Row],['[m/s']]]^2,Druckverlust(Tabelle7[[#This Row],[Spalte1]],C12,U12,V12,P12,L12,O12,J12,K12,Q12,D12,E12))","v":{"v":1079.7604724209816,"d":"1079.76"}},0.010797604724209816,{"$f":"J12/10^5","v":{"v":18.69743296537659,"d":"18.70"}},{"$f":"Z12-Y12","v":{"v":18.686635360652378,"d":"18.69"}},{"$f":"X12","v":{"v":1079.7604724209816,"d":"1079.76"}},{"$f":"SUM($AB$10:AB12)","v":{"v":131336.46393476205,"d":"131336.46"}}]
[null,"Rohr ","Rohr",4.8,0.019,{"v":4e-05,"d":"4.00E-05"},141.12,0.0392,{"v":0.029540824612084914,"d":"2.95E-02"},1868663.5360652378,338,{"$f":"Dichte(K13,J13)","v":{"v":1.3269771753075434,"d":"1.32698"}},{"$f":"VLOOKUP(J13*0.00001,'Datenbak Werte'!$A$1:$B$500,2,TRUE)*0.000001","v":{"v":9.7148999999999991E-6,"d":"9.71E-06"}},{"v":7.3210754342842784E-6,"d":"7.32E-06"},{"v":0.08988,"d":"8.99E-02"},{"$f":"Tabelle7[[#This Row],['[kg/h']]]/Tabelle7[[#This Row],['[kg/m^3']4]]","v":{"v":1570.0934579439252,"d":"1570.09"}},{"v":104.18987833848279,"d":"104.19"},{"$f":"Tabelle7[[#This Row],['[m/s']]]/VLOOKUP(J13*0.00001,'Datenbak Werte'!$A$1:$C$500,3,TRUE)","v":{"v":0.07378364020854244,"d":"0.07"}},{"v":270398.4826000776,"d":"2.7040E+05"},{"v":2.1052631578947372E-3,"d":"2.1E-03"},{"$f":"Rohrreibungszahl(Tabelle7[[#This Row],['[-']]],Tabelle7[[#This Row],['[-']4]],Tabelle7[[#This Row],['[-']3]],Tabelle7[[#This Row],['[m']2]],Tabelle7[[#This Row],['[m']3]])","v":{"v":0.024359666043942293,"d":"2.44E-02"}},null,null,{"$f":"IF(Tabelle7[[#This Row],['[-']2]]>0,Tabelle7[[#This Row],['[-']2]]*(Tabelle7[[#This Row],['[kg/m^3']]]/2)*Tabelle7[[#This Row],['[m/s']]]^2,Druckverlust(Tabelle7[[#This Row],[Spalte1]],C13,U13,V13,P13,L13,O13,J13,K13,Q13,D13,E13))","v":{"v":44324.463282709614,"d":"44324.46"}},0.44324463282709614,{"v":18.686635360652378,"d":"18.69"},{"v":18.243390727825282,"d":"18.24"},{"v":44324.463282709614,"d":"44324.46"},{"$f":"SUM($AB$10:AB13)","v":{"v":175660.92721747168,"d":"175660.93"}}]
[null,"90°Winkel","Rohr",null,0.019,{"v":4e-05,"d":"4.00E-05"},141.12,0.0392,{"v":0.030251344936799873,"d":"3.03E-02"},1824339.0727825284,338,{"$f":"Dichte(K14,J14)","v":{"v":1.2958101559416735,"d":"1.29581"}},{"$f":"VLOOKUP(J14*0.00001,'Datenbak Werte'!$A$1:$B$500,2,TRUE)*0.000001","v":{"v":9.7148999999999991E-6,"d":"9.71E-06"}},{"v":7.4971630338397214E-6,"d":"7.50E-06"},{"v":0.08988,"d":"8.99E-02"},{"$f":"Tabelle7[[#This Row],['[kg/h']]]/Tabelle7[[#This Row],['[kg/m^3']4]]","v":{"v":1570.0934579439252,"d":"1570.09"}},{"v":106.69586885029763,"d":"106.70"},{"$f":"Tabelle7[[#This Row],['[m/s']]]/VLOOKUP(J14*0.00001,'Datenbak Werte'!$A$1:$C$500,3,TRUE)","v":{"v":0.07555829534048412,"d":"0.08"}},{"v":270398.4826000776,"d":"2.7040E+05"},{"v":2.1052631578947372E-3,"d":"2.1E-03"},{"$f":"Rohrreibungszahl(Tabelle7[[#This Row],['[-']]],Tabelle7[[#This Row],['[-']4]],Tabelle7[[#This Row],['[-']3]],Tabelle7[[#This Row],['[m']2]],Tabelle7[[#This Row],['[m']3]])","v":{"v":0.024359666043942293,"d":"2.44E-02"}},null,0.15,{"$f":"IF(Tabelle7[[#This Row],['[-']2]]>0,Tabelle7[[#This Row],['[-']2]]*(Tabelle7[[#This Row],['[kg/m^3']]]/2)*Tabelle7[[#This Row],['[m/s']]]^2,Druckverlust(Tabelle7[[#This Row],[Spalte1]],C14,U14,V14,P14,L14,O14,J14,K14,Q14,D14,E14))","v":{"v":1106.3635303917513,"d":"1106.36"}},0.011063635303917513,{"v":18.243390727825282,"d":"18.24"},{"v":18.232327092521366,"d":"18.23"},{"v":1106.3635303917513,"d":"1106.36"},{"$f":"SUM($AB$10:AB14)","v":{"v":176767.29074786342,"d":"176767.29"}}]
[null,"Rohr ","Rohr",3,0.019,{"v":4e-05,"d":"4.00E-05"},141.12,0.0392,{"v":0.030269521847489166,"d":"3.03E-02"},1823232.7092521365,338,{"$f":"Dichte(K15,J15)","v":{"v":1.2950320192537699,"d":"1.29503"}},{"$f":"VLOOKUP(J15*0.00001,'Datenbak Werte'!$A$1:$B$500,2,TRUE)*0.000001","v":{"v":9.7148999999999991E-6,"d":"9.71E-06"}},{"v":7.5016678009227676E-6,"d":"7.50E-06"},{"v":0.08988,"d":"8.99E-02"},{"$f":"Tabelle7[[#This Row],['[kg/h']]]/Tabelle7[[#This Row],['[kg/m^3']4]]","v":{"v":1570.0934579439252,"d":"1570.09"}},{"v":106.75997843891462,"d":"106.76"},{"$f":"Tabelle7[[#This Row],['[m/s']]]/VLOOKUP(J15*0.00001,'Datenbak Werte'!$A$1:$C$500,3,TRUE)","v":{"v":0.07560369551654601,"d":"0.08"}},{"v":270398.48260007764,"d":"2.7040E+05"},{"v":2.1052631578947372E-3,"d":"2.1E-03"},{"$f":"Rohrreibungszahl(Tabelle7[[#This Row],['[-']]],Tabelle7[[#This Row],['[-']4]],Tabelle7[[#This Row],['[-']3]],Tabelle7[[#This Row],['[m']2]],Tabelle7[[#This Row],['[m']3]])","v":{"v":0.024359666043942293,"d":"2.44E-02"}},null,null,{"$f":"IF(Tabelle7[[#This Row],['[-']2]]>0,Tabelle7[[#This Row],['[-']2]]*(Tabelle7[[#This Row],['[kg/m^3']]]/2)*Tabelle7[[#This Row],['[m/s']]]^2,Druckverlust(Tabelle7[[#This Row],[Spalte1]],C15,U15,V15,P15,L15,O15,J15,K15,Q15,D15,E15))","v":{"v":28386.147122932292,"d":"28386.15"}},0.2838614712293229,{"v":18.232327092521366,"d":"18.23"},{"v":17.948465621292044,"d":"17.95"},{"v":28386.147122932292,"d":"28386.15"},{"$f":"SUM($AB$10:AB15)","v":{"v":205153.43787079572,"d":"205153.44"}}]
[null,"90°Winkel","Rohr",null,0.019,{"v":4e-05,"d":"4.00E-05"},141.12,0.0392,{"v":0.030743553157104385,"d":"3.07E-02"},1794846.5621292044,338,{"$f":"Dichte(K16,J16)","v":{"v":1.2750640695199362,"d":"1.27506"}},{"$f":"VLOOKUP(J16*0.00001,'Datenbak Werte'!$A$1:$B$500,2,TRUE)*0.000001","v":{"v":9.7143e-06,"d":"9.71E-06"}},{"v":7.6186759804606912E-6,"d":"7.62E-06"},{"v":0.08988,"d":"8.99E-02"},{"$f":"Tabelle7[[#This Row],['[kg/h']]]/Tabelle7[[#This Row],['[kg/m^3']4]]","v":{"v":1570.0934579439252,"d":"1570.09"}},{"v":108.43187707837359,"d":"108.43"},{"$f":"Tabelle7[[#This Row],['[m/s']]]/VLOOKUP(J16*0.00001,'Datenbak Werte'!$A$1:$C$500,3,TRUE)","v":{"v":0.07683120320156847,"d":"0.08"}},{"v":270415.18365826603,"d":"2.7042E+05"},{"v":2.1052631578947372E-3,"d":"2.1E-03"},{"$f":"Rohrreibungszahl(Tabelle7[[#This Row],['[-']]],Tabelle7[[#This Row],['[-']4]],Tabelle7[[#This Row],['[-']3]],Tabelle7[[#This Row],['[m']2]],Tabelle7[[#This Row],['[m']3]])","v":{"v":0.0243596277693807,"d":"2.44E-02"}},null,0.15,{"$f":"IF(Tabelle7[[#This Row],['[-']2]]>0,Tabelle7[[#This Row],['[-']2]]*(Tabelle7[[#This Row],['[kg/m^3']]]/2)*Tabelle7[[#This Row],['[m/s']]]^2,Druckverlust(Tabelle7[[#This Row],[Spalte1]],C16,U16,V16,P16,L16,O16,J16,K16,Q16,D16,E16))","v":{"v":1124.3647539883095,"d":"1124.36"}},0.011243647539883096,{"v":17.948465621292044,"d":"17.95"},{"v":17.937221973752163,"d":"17.94"},{"v":1124.3647539883095,"d":"1124.36"},{"$f":"SUM($AB$10:AB16)","v":{"v":206277.80262478403,"d":"206277.80"}}]
[null,"Rohr (Durchführung FRP)","Rohr",1.6,0.019,{"v":4e-05,"d":"4.00E-05"},141.12,0.0392,{"v":0.030762638274863623,"d":"3.08E-02"},1793722.1973752163,338,{"$f":"Dichte(K17,J17)","v":{"v":1.2742730207256185,"d":"1.27427"}},{"$f":"VLOOKUP(J17*0.00001,'Datenbak Werte'!$A$1:$B$500,2,TRUE)*0.000001","v":{"v":9.7143e-06,"d":"9.71E-06"}},{"v":7.6234055355486656E-6,"d":"7.62E-06"},{"v":0.08988,"d":"8.99E-02"},{"$f":"Tabelle7[[#This Row],['[kg/h']]]/Tabelle7[[#This Row],['[kg/m^3']4]]","v":{"v":1570.0934579439252,"d":"1570.09"}},{"v":108.49918989457021,"d":"108.50"},{"$f":"Tabelle7[[#This Row],['[m/s']]]/VLOOKUP(J17*0.00001,'Datenbak Werte'!$A$1:$C$500,3,TRUE)","v":{"v":0.07687889881284646,"d":"0.08"}},{"v":270415.183658266,"d":"2.7042E+05"},{"v":2.1052631578947372E-3,"d":"2.1E-03"},{"$f":"Rohrreibungszahl(Tabelle7[[#This Row],['[-']]],Tabelle7[[#This Row],['[-']4]],Tabelle7[[#This Row],['[-']3]],Tabelle7[[#This Row],['[m']2]],Tabelle7[[#This Row],['[m']3]])","v":{"v":0.0243596277693807,"d":"2.44E-02"}},null,null,{"$f":"IF(Tabelle7[[#This Row],['[-']2]]>0,Tabelle7[[#This Row],['[-']2]]*(Tabelle7[[#This Row],['[kg/m^3']]]/2)*Tabelle7[[#This Row],['[m/s']]]^2,Druckverlust(Tabelle7[[#This Row],[Spalte1]],C17,U17,V17,P17,L17,O17,J17,K17,Q17,D17,E17))","v":{"v":15385.88609911973,"d":"15385.89"}},0.1538588609911973,{"v":17.937221973752163,"d":"17.94"},{"v":17.783363112760966,"d":"17.78"},{"v":15385.88609911973,"d":"15385.89"},{"$f":"SUM($AB$10:AB17)","v":{"v":221663.68872390376,"d":"221663.69"}}]
[null,"Filter","Ventil",null,0.019,{"v":4e-05,"d":"4.00E-05"},141.12,0.0392,{"v":0.03102622505957519,"d":"3.10E-02"},1778336.3112760966,338,{"$f":"Dichte(K18,J18)","v":{"v":1.2634472909524084,"d":"1.26345"}},{"$f":"VLOOKUP(J18*0.00001,'Datenbak Werte'!$A$1:$B$500,2,TRUE)*0.000001","v":{"v":9.7143e-06,"d":"9.71E-06"}},{"v":7.6887259718426335E-6,"d":"7.69E-06"},{"v":0.08988,"d":"8.99E-02"},{"$f":"Tabelle7[[#This Row],['[kg/h']]]/Tabelle7[[#This Row],['[kg/m^3']4]]","v":{"v":1570.0934579439252,"d":"1570.09"}},{"v":109.42885504073189,"d":"109.43"},{"$f":"Tabelle7[[#This Row],['[m/s']]]/VLOOKUP(J18*0.00001,'Datenbak Werte'!$A$1:$C$500,3,TRUE)","v":{"v":0.07753762845655204,"d":"0.08"}},{"v":270415.18365826603,"d":"2.7042E+05"},{"v":2.1052631578947372E-3,"d":"2.1E-03"},{"$f":"Rohrreibungszahl(Tabelle7[[#This Row],['[-']]],Tabelle7[[#This Row],['[-']4]],Tabelle7[[#This Row],['[-']3]],Tabelle7[[#This Row],['[m']2]],Tabelle7[[#This Row],['[m']3]])","v":"Nur bei 'Rohr' benötigt"},4,null,{"$f":"IF(Tabelle7[[#This Row],['[-']2]]>0,Tabelle7[[#This Row],['[-']2]]*(Tabelle7[[#This Row],['[kg/m^3']]]/2)*Tabelle7[[#This Row],['[m/s']]]^2,Druckverlust(Tabelle7[[#This Row],[Spalte1]],C18,U18,V18,P18,L18,O18,J18,K18,Q18,D18,E18))","v":{"v":105936.19302835937,"d":"105936.19"}},1.0593619302835937,{"v":17.783363112760966,"d":"17.78"},{"v":16.724001182477373,"d":"16.72"},{"v":105936.19302835937,"d":"105936.19"},{"$f":"SUM($AB$10:AB18)","v":{"v":327599.8817522631,"d":"327599.88"}}]
[null,"Rückschlag-/Absperrventil","Ventil",null,0.019,{"v":4e-05,"d":"4.00E-05"},141.12,0.0392,{"v":0.03297275439016693,"d":"3.30E-02"},1672400.1182477374,338,{"$f":"Dichte(K19,J19)","v":{"v":1.1888603401507198,"d":"1.18886"}},{"$f":"VLOOKUP(J19*0.00001,'Datenbak Werte'!$A$1:$B$500,2,TRUE)*0.000001","v":{"v":9.7138e-06,"d":"9.71E-06"}},{"v":8.1706821835511116E-6,"d":"8.17E-06"},{"v":0.08988,"d":"8.99E-02"},{"$f":"Tabelle7[[#This Row],['[kg/h']]]/Tabelle7[[#This Row],['[kg/m^3']4]]","v":{"v":1570.0934579439252,"d":"1570.09"}},{"v":116.29422379058305,"d":"116.29"},{"$f":"Tabelle7[[#This Row],['[m/s']]]/VLOOKUP(J19*0.00001,'Datenbak Werte'!$A$1:$C$500,3,TRUE)","v":{"v":0.08244893568988518,"d":"0.08"}},{"v":270429.1027827929,"d":"2.7043E+05"},{"v":2.1052631578947372E-3,"d":"2.1E-03"},{"$f":"Rohrreibungszahl(Tabelle7[[#This Row],['[-']]],Tabelle7[[#This Row],['[-']4]],Tabelle7[[#This Row],['[-']3]],Tabelle7[[#This Row],['[m']2]],Tabelle7[[#This Row],['[m']3]])","v":"Nur bei 'Rohr' benötigt"},4,null,{"$f":"IF(Tabelle7[[#This Row],['[-']2]]>0,Tabelle7[[#This Row],['[-']2]]*(Tabelle7[[#This Row],['[kg/m^3']]]/2)*Tabelle7[[#This Row],['[m/s']]]^2,Druckverlust(Tabelle7[[#This Row],[Spalte1]],C19,U19,V19,P19,L19,O19,J19,K19,Q19,D19,E19))","v":{"v":113660.89954051559,"d":"113660.90"}},1.136608995405156,{"v":16.724001182477373,"d":"16.72"},{"v":15.587392187072217,"d":"15.59"},{"v":113660.89954051559,"d":"113660.90"},{"$f":"SUM($AB$10:AB19)","v":{"v":441260.7812927787,"d":"441260.78"}}]
[null,"T-Stück (Eingang Sammelrohr) ","Rohr",null,0.019,{"v":4e-05,"d":"4.00E-05"},141.12,0.0392,{"v":0.03535545174001689,"d":"3.54E-02"},1558739.2187072216,338,{"$f":"Dichte(K20,J20)","v":{"v":1.1087398992453454,"d":"1.10874"}},{"$f":"VLOOKUP(J20*0.00001,'Datenbak Werte'!$A$1:$B$500,2,TRUE)*0.000001","v":{"v":9.7133e-06,"d":"9.71E-06"}},{"v":8.7606660557731141E-6,"d":"8.76E-06"},{"v":0.08988,"d":"8.99E-02"},{"$f":"Tabelle7[[#This Row],['[kg/h']]]/Tabelle7[[#This Row],['[kg/m^3']4]]","v":{"v":1570.0934579439252,"d":"1570.09"}},{"v":124.6979481367455,"d":"124.70"},{"$f":"Tabelle7[[#This Row],['[m/s']]]/VLOOKUP(J20*0.00001,'Datenbak Werte'!$A$1:$C$500,3,TRUE)","v":{"v":0.08845708174558096,"d":"0.09"}},{"v":270443.0233403162,"d":"2.7044E+05"},{"v":2.1052631578947372E-3,"d":"2.1E-03"},{"$f":"Rohrreibungszahl(Tabelle7[[#This Row],['[-']]],Tabelle7[[#This Row],['[-']4]],Tabelle7[[#This Row],['[-']3]],Tabelle7[[#This Row],['[m']2]],Tabelle7[[#This Row],['[m']3]])","v":{"v":0.024359563978024894,"d":"2.44E-02"}},null,0.9,{"$f":"IF(Tabelle7[[#This Row],['[-']2]]>0,Tabelle7[[#This Row],['[-']2]]*(Tabelle7[[#This Row],['[kg/m^3']]]/2)*Tabelle7[[#This Row],['[m/s']]]^2,Druckverlust(Tabelle7[[#This Row],[Spalte1]],C20,U20,V20,P20,L20,O20,J20,K20,Q20,D20,E20))","v":{"v":7758.197029732089,"d":"7758.20"}},0.07758197029732089,{"v":15.587392187072215,"d":"15.59"},{"v":15.509810216774895,"d":"15.51"},{"v":7758.197029732089,"d":"7758.20"},{"$f":"SUM($AB$10:AB20)","v":{"v":449018.9783225108,"d":"449018.98"}}]
{"$rows_left_out":39}
{"sheet":"Datenbak Werte","index":1,"n_rows":503,"n_cols":3,"rows_kept":503}
["Pressure (bar)","Viscosity (uPa*s)","Sound Spd, (m/s)"]
[0,9.707,1397.6]
[1,9.7074,1398.4]
[2,9.7077,1399.2]
[3,9.7081,1400]
[4,9.7084,1400.8]
[5,9.7088,1401.6]
[6,9.7092,1402.4]
[7,9.7096,1403.2]
[8,9.71,1404]
[9,9.7104,1404.8]
[10,9.7109,1405.6]
[11,9.7113,1406.5]
[12,9.7118,1407.3]
[13,9.7123,1408.1]
[14,9.7128,1408.9]
[15,9.7133,1409.7]
[16,9.7138,1410.5]
[17,9.7143,1411.3]
[18,9.7149,1412.1]
{"$rows_left_out":483}